[jira] [Created] (DISPATCH-805) System test system_tests_sasl_plain fails in systems with TLSv1.2

classic Classic list List threaded Threaded
1 message Options
Reply | Threaded
Open this post in threaded view
|  
Report Content as Inappropriate

[jira] [Created] (DISPATCH-805) System test system_tests_sasl_plain fails in systems with TLSv1.2

JIRA jira@apache.org
Ganesh Murthy created DISPATCH-805:
--------------------------------------

             Summary: System test system_tests_sasl_plain fails in systems with TLSv1.2
                 Key: DISPATCH-805
                 URL: https://issues.apache.org/jira/browse/DISPATCH-805
             Project: Qpid Dispatch
          Issue Type: Bug
          Components: Routing Engine, Tests
    Affects Versions: 0.8.0
            Reporter: Ganesh Murthy
            Assignee: Ganesh Murthy
             Fix For: 1.0.0


A couple of tests in system_tests_sasl_plain.py tests for hard coded string *TLSv1/SSLv3* as the TLS version. The version of TLS can vary. It could be *TLSv1.2*

Instead of asserting
{noformat}
self.assertEqual(u'TLSv1/SSLv3', results[0][10])
{noformat}

we should do
{noformat}
self.assertTrue(u'TLSv1' in results[0][10])
{noformat}

Following is the trace from the failing test
{noformat}
24: ======================================================================
24: FAIL: test_inter_router_plain_over_ssl_exists (system_tests_sasl_plain.RouterTestVerifyHostNameNo)
24: ----------------------------------------------------------------------
24: Traceback (most recent call last):
24:   File "/foo/qpid-dispatch/tests/system_tests_sasl_plain.py", line 525, in test_inter_router_plain_over_ssl_exists
24:     self.common_asserts(results)
24:   File "/foo/qpid-dispatch/tests/system_tests_sasl_plain.py", line 503, in common_asserts
24:     self.assertEqual(u'TLSv1/SSLv3', results[N][10])
24: AssertionError: u'TLSv1/SSLv3' != u'TLSv1.2'
24: - TLSv1/SSLv3
24: + TLSv1.2
24:
24:
24: ======================================================================
24: FAIL: test_zzz_delete_create_ssl_profile (system_tests_sasl_plain.RouterTestVerifyHostNameNo)
24: ----------------------------------------------------------------------
24: Traceback (most recent call last):
24:   File "/foo/qpid-dispatch/tests/system_tests_sasl_plain.py", line 564, in test_zzz_delete_create_ssl_profile
24:     self.common_asserts(results)
24:   File "/foo/qpid-dispatch/tests/system_tests_sasl_plain.py", line 503, in common_asserts
24:     self.assertEqual(u'TLSv1/SSLv3', results[N][10])
24: AssertionError: u'TLSv1/SSLv3' != u'TLSv1.2'
24: - TLSv1/SSLv3
24: + TLSv1.2
24:
24:
24: ----------------------------------------------------------------------
24: Ran 8 tests in 15.760s
24:
24: FAILED (failures=3)
{noformat}



--
This message was sent by Atlassian JIRA
(v6.4.14#64029)

---------------------------------------------------------------------
To unsubscribe, e-mail: [hidden email]
For additional commands, e-mail: [hidden email]

Loading...